Target
Ubiquitin carboxyl-terminal hydrolase 30
Ligand
BDBM483940
Substrate
Meas. Tech.
Biochemical Assay
IC50
>10000±n/a nM
Citation
 Stockley, MLKemp, MI Cyano-subtituted heterocycles with activity as inhibitors of USP30 US Patent  US10927110 Publication Date 2/23/2021 
Target
Name:
Ubiquitin carboxyl-terminal hydrolase 30
Synonyms:
Deubiquitinating enzyme 30 USP30 Ubiquitin carboxyl-terminal hydrolase 30 (USP30) Ubiquitin-specific-processing protease 30
Type:
Protein
Mol. Mass.:
58522.90
Organism:
Homo sapiens (Human)
Description:
Q70CQ3
Residue:
517
  
Inhibitor
Name:
BDBM483940
Synonyms:
3-(4-(2-Phenoxyphenyl)oxazol-2-yl)piperidine-1-carbonitrile | US10927110, Example 7
Type:
Small organic molecule
Emp. Form.:
C21H19N3O2
Mol. Mass.:
345.3945
SMILES:
N#CN1CCCC(C1)c1nc(co1)-c1ccccc1Oc1ccccc1
: