Target
RAF proto-oncogene serine/threonine-protein kinase
Ligand
BDBM483972
Substrate
Meas. Tech.
Kinase Assay
IC50
<0.1±n/a nM
Citation
 Kaldor, SWKanouni, TArnold, L Inhibitors of RAF kinases US Patent  US10927111 Publication Date 2/23/2021 
Target
Name:
RAF proto-oncogene serine/threonine-protein kinase
Synonyms:
C-Raf Protein Kinase RAF RAF1 Raf-1 Serine/threonine-protein kinase C-Raf | cRaf
Type:
Serine/threonine-protein kinase
Mol. Mass.:
73082.52
Organism:
Homo sapiens (Human)
Description:
P04049
Residue:
648
  
Inhibitor
Name:
BDBM483972
Synonyms:
US10927111, Example 8 US11667634, Example 9
Type:
Small organic molecule
Emp. Form.:
C22H23F3N6O2
Mol. Mass.:
460.4522
SMILES:
CNc1ncc2cc(c(C)nc2n1)-c1cc(NC(=O)N2CC[C@H](C2)OC(F)(F)F)ccc1C
: