Target
RAF proto-oncogene serine/threonine-protein kinase
Ligand
BDBM484011
Substrate
Meas. Tech.
Kinase Assay
IC50
<0.1±n/a nM
Citation
 Kaldor, SWKanouni, TArnold, L Inhibitors of RAF kinases US Patent  US10927111 Publication Date 2/23/2021 
Target
Name:
RAF proto-oncogene serine/threonine-protein kinase
Synonyms:
C-Raf Protein Kinase RAF RAF1 Raf-1 Serine/threonine-protein kinase C-Raf | cRaf
Type:
Serine/threonine-protein kinase
Mol. Mass.:
73082.52
Organism:
Homo sapiens (Human)
Description:
P04049
Residue:
648
  
Inhibitor
Name:
BDBM484011
Synonyms:
2-methyl-N-(6-methyl-5-(2- (methylamino)pyrido[2,3-d]pyrimidin- 6-yl)pyridin-3-yl)-3- (trifluoromethyl)benzamide US11667634, Example 47
Type:
Small organic molecule
Emp. Form.:
C23H19F3N6O
Mol. Mass.:
452.4318
SMILES:
CNc1ncc2cc(cnc2n1)-c1cc(NC(=O)c2cccc(c2C)C(F)(F)F)cnc1C
: