Target
RAF proto-oncogene serine/threonine-protein kinase
Ligand
BDBM484029
Substrate
Meas. Tech.
Kinase Assay
IC50
<0.1±n/a nM
Citation
 Kaldor, SWKanouni, TArnold, L Inhibitors of RAF kinases US Patent  US10927111 Publication Date 2/23/2021 
Target
Name:
RAF proto-oncogene serine/threonine-protein kinase
Synonyms:
C-Raf Protein Kinase RAF RAF1 Raf-1 Serine/threonine-protein kinase C-Raf | cRaf
Type:
Serine/threonine-protein kinase
Mol. Mass.:
73082.52
Organism:
Homo sapiens (Human)
Description:
P04049
Residue:
648
  
Inhibitor
Name:
BDBM484029
Synonyms:
N-[3-[7-ethenyl-2- (methylamino)pyrido[2,3-d]pyrimidin- 6-yl]-4-methylphenyl]-2- (trifluoromethyl)pyridine-4- carboxamide US11667634, Example 65
Type:
Small organic molecule
Emp. Form.:
C24H19F3N6O
Mol. Mass.:
464.4425
SMILES:
CNc1ncc2cc(c(C=C)nc2n1)-c1cc(NC(=O)c2ccnc(c2)C(F)(F)F)ccc1C
: