Target
RAF proto-oncogene serine/threonine-protein kinase
Ligand
BDBM484042
Substrate
Meas. Tech.
Kinase Assay
IC50
<0.1±n/a nM
Citation
 Kaldor, SWKanouni, TArnold, L Inhibitors of RAF kinases US Patent  US10927111 Publication Date 2/23/2021 
Target
Name:
RAF proto-oncogene serine/threonine-protein kinase
Synonyms:
C-Raf Protein Kinase RAF RAF1 Raf-1 Serine/threonine-protein kinase C-Raf | cRaf
Type:
Serine/threonine-protein kinase
Mol. Mass.:
73082.52
Organism:
Homo sapiens (Human)
Description:
P04049
Residue:
648
  
Inhibitor
Name:
BDBM484042
Synonyms:
(3R)-N-[3-[7-cyano-2- (methylamino)pyrido[2,3-d]pyrimidin- 6-yl]-4-methylphenyl]-3- (trifluoromethoxy)pyrrolidine-1- carboxamide US11667634, Example 78
Type:
Small organic molecule
Emp. Form.:
C22H20F3N7O2
Mol. Mass.:
471.4351
SMILES:
CNc1ncc2cc(c(nc2n1)C#N)-c1cc(NC(=O)N2CC[C@H](C2)OC(F)(F)F)ccc1C
: