Target
SH2B adapter protein 2
Ligand
BDBM484440
Substrate
Meas. Tech.
Inhibition Assay
IC50
1.000±n/a nM
Citation
 Chen, ZFortanet, JGKarki, RLamarche, MJMajumdar, DPerez, LBSendzik, MSmith, TDYang, FYu, B Compounds and compositions for inhibiting the activity of SHP2 US Patent  US10934285 Publication Date 3/2/2021 
Target
Name:
SH2B adapter protein 2
Synonyms:
APS SH2 and PH domain-containing adapter protein APS SH2B2_HUMAN
Type:
Protein
Mol. Mass.:
67733.52
Organism:
Human
Description:
O14492
Residue:
632
  
Inhibitor
Name:
BDBM484440
Synonyms:
US10934285, Example 24
Type:
Small organic molecule
Emp. Form.:
C28H33ClN8O3S
Mol. Mass.:
597.131
SMILES:
N[C@@H]1CCCC11CCN(CC1)c1cnc(Sc2cccc(NC(=O)c3c(O)nc4CCCCn4c3=O)c2Cl)c(N)n1
: