Target
SH2B adapter protein 2
Ligand
BDBM484441
Substrate
Meas. Tech.
Inhibition Assay
IC50
23.0±n/a nM
Citation
 Chen, ZFortanet, JGKarki, RLamarche, MJMajumdar, DPerez, LBSendzik, MSmith, TDYang, FYu, B Compounds and compositions for inhibiting the activity of SHP2 US Patent  US10934285 Publication Date 3/2/2021 
Target
Name:
SH2B adapter protein 2
Synonyms:
APS SH2 and PH domain-containing adapter protein APS SH2B2_HUMAN
Type:
Protein
Mol. Mass.:
67733.52
Organism:
Human
Description:
O14492
Residue:
632
  
Inhibitor
Name:
BDBM484441
Synonyms:
N-(3-((3-Amino-5-((3S,4S)-4-amino-3-methyl-2-oxa-8-azaspiro[4.5]decan-8-yl)pyrazin-2-yl)thio)-2-chlorophenyl)-2-hydroxy-4-oxo-6,7,8,9-tetrahydro-4H-pyrido[1,2-a]pyrimidine-3-carboxamide | US10934285, Example 27
Type:
Small organic molecule
Emp. Form.:
C28H33ClN8O4S
Mol. Mass.:
613.131
SMILES:
C[C@@H]1OCC2(CCN(CC2)c2cnc(Sc3cccc(NC(=O)c4c(O)nc5CCCCn5c4=O)c3Cl)c(N)n2)[C@@H]1N
: