Target
SH2B adapter protein 2
Ligand
BDBM484444
Substrate
Meas. Tech.
Inhibition Assay
IC50
16.0±n/a nM
Citation
 Chen, ZFortanet, JGKarki, RLamarche, MJMajumdar, DPerez, LBSendzik, MSmith, TDYang, FYu, B Compounds and compositions for inhibiting the activity of SHP2 US Patent  US10934285 Publication Date 3/2/2021 
Target
Name:
SH2B adapter protein 2
Synonyms:
APS SH2 and PH domain-containing adapter protein APS SH2B2_HUMAN
Type:
Protein
Mol. Mass.:
67733.52
Organism:
Human
Description:
O14492
Residue:
632
  
Inhibitor
Name:
BDBM484444
Synonyms:
US10934285, Example 30
Type:
Small organic molecule
Emp. Form.:
C29H34ClFN8O3S
Mol. Mass.:
629.148
SMILES:
C[C@@H]1CC2(CCN(CC2)c2cnc(Sc3cccc(NC(=O)c4c(O)nc5CCCCn5c4=O)c3Cl)c(N)n2)[C@H](N)[C@H]1F
: