Target
SH2B adapter protein 2
Ligand
BDBM484454
Substrate
Meas. Tech.
Inhibition Assay
IC50
173±n/a nM
Citation
 Chen, ZFortanet, JGKarki, RLamarche, MJMajumdar, DPerez, LBSendzik, MSmith, TDYang, FYu, B Compounds and compositions for inhibiting the activity of SHP2 US Patent  US10934285 Publication Date 3/2/2021 
Target
Name:
SH2B adapter protein 2
Synonyms:
APS SH2 and PH domain-containing adapter protein APS SH2B2_HUMAN
Type:
Protein
Mol. Mass.:
67733.52
Organism:
Human
Description:
O14492
Residue:
632
  
Inhibitor
Name:
BDBM484454
Synonyms:
US10934285, Example 40
Type:
Small organic molecule
Emp. Form.:
C25H26ClN9O2S
Mol. Mass.:
552.051
SMILES:
CC1(CN)CCN(CC1)c1nnc(Sc2cccc(NC(=O)c3cnc4ccccn4c3=O)c2Cl)c(N)n1
: