Target
SH2B adapter protein 2
Ligand
BDBM484456
Substrate
Meas. Tech.
Inhibition Assay
IC50
16.0±n/a nM
Citation
 Chen, ZFortanet, JGKarki, RLamarche, MJMajumdar, DPerez, LBSendzik, MSmith, TDYang, FYu, B Compounds and compositions for inhibiting the activity of SHP2 US Patent  US10934285 Publication Date 3/2/2021 
Target
Name:
SH2B adapter protein 2
Synonyms:
APS SH2 and PH domain-containing adapter protein APS SH2B2_HUMAN
Type:
Protein
Mol. Mass.:
67733.52
Organism:
Human
Description:
O14492
Residue:
632
  
Inhibitor
Name:
BDBM484456
Synonyms:
US10934285, Example 42
Type:
Small organic molecule
Emp. Form.:
C27H28ClN9O3S
Mol. Mass.:
594.088
SMILES:
N[C@@H]1CCCC11CCN(CC1)c1nnc(Sc2cccc(NC(=O)c3c(O)nc4ccccn4c3=O)c2Cl)c(N)n1
: