Target
SH2B adapter protein 2
Ligand
BDBM484461
Substrate
Meas. Tech.
Inhibition Assay
IC50
3.00±n/a nM
Citation
 Chen, ZFortanet, JGKarki, RLamarche, MJMajumdar, DPerez, LBSendzik, MSmith, TDYang, FYu, B Compounds and compositions for inhibiting the activity of SHP2 US Patent  US10934285 Publication Date 3/2/2021 
Target
Name:
SH2B adapter protein 2
Synonyms:
APS SH2 and PH domain-containing adapter protein APS SH2B2_HUMAN
Type:
Protein
Mol. Mass.:
67733.52
Organism:
Human
Description:
O14492
Residue:
632
  
Inhibitor
Name:
BDBM484461
Synonyms:
US10934285, Example 47
Type:
Small organic molecule
Emp. Form.:
C29H28ClN7O3S
Mol. Mass.:
590.096
SMILES:
CC1(N)CCN(CC1)c1nc2ccc(Sc3cccc(NC(=O)C4=C(O)CN(C4=O)c4ccccc4)c3Cl)nc2[nH]1
: