Target
SH2B adapter protein 2
Ligand
BDBM484474
Substrate
Meas. Tech.
Inhibition Assay
IC50
22.0±n/a nM
Citation
 Chen, ZFortanet, JGKarki, RLamarche, MJMajumdar, DPerez, LBSendzik, MSmith, TDYang, FYu, B Compounds and compositions for inhibiting the activity of SHP2 US Patent  US10934285 Publication Date 3/2/2021 
Target
Name:
SH2B adapter protein 2
Synonyms:
APS SH2 and PH domain-containing adapter protein APS SH2B2_HUMAN
Type:
Protein
Mol. Mass.:
67733.52
Organism:
Human
Description:
O14492
Residue:
632
  
Inhibitor
Name:
BDBM484474
Synonyms:
US10934285, Example 61
Type:
Small organic molecule
Emp. Form.:
C30H29ClN6O3S
Mol. Mass.:
589.108
SMILES:
CN1C(Cc2ccccc2)C(O)=C(C(=O)Nc2cccc(Sc3ccc4nc([nH]c4n3)N3CCCCC3)c2Cl)C1=O
: