Target
Mitogen-activated protein kinase kinase kinase kinase 1
Ligand
BDBM414611
Substrate
Meas. Tech.
Kinase Binding Assay
Ki
<100±n/a nM
Citation
 Vechorkin, OLiu, KSokolsky, AWang, AYe, HFYe, QYao, W Pyrazolopyridine compounds and uses thereof US Patent  US10934288 Publication Date 3/2/2021 
Target
Name:
Mitogen-activated protein kinase kinase kinase kinase 1
Synonyms:
HPK1 MAP4K1
Type:
PROTEIN
Mol. Mass.:
91316.07
Organism:
Homo sapiens (Human)
Description:
ChEMBL_586597
Residue:
833
  
Inhibitor
Name:
BDBM414611
Synonyms:
US10435405, Example 28 | US10934288, Example 28
Type:
Small organic molecule
Emp. Form.:
C26H27FN6O2
Mol. Mass.:
474.53
SMILES:
CCN1CCN(CC1)c1ccc(cc1)C(=O)Nc1n[nH]c2cnc(cc12)-c1c(F)cccc1OC
: