Target
Mitogen-activated protein kinase kinase kinase kinase 1
Ligand
BDBM414705
Substrate
Meas. Tech.
Kinase Binding Assay
Ki
<100±n/a nM
Citation
 Vechorkin, OLiu, KSokolsky, AWang, AYe, HFYe, QYao, W Pyrazolopyridine compounds and uses thereof US Patent  US10934288 Publication Date 3/2/2021 
Target
Name:
Mitogen-activated protein kinase kinase kinase kinase 1
Synonyms:
HPK1 MAP4K1
Type:
PROTEIN
Mol. Mass.:
91316.07
Organism:
Homo sapiens (Human)
Description:
ChEMBL_586597
Residue:
833
  
Inhibitor
Name:
BDBM414705
Synonyms:
US10435405, Example 122 | US10934288, Example 122
Type:
Small organic molecule
Emp. Form.:
C18H16F2N6
Mol. Mass.:
354.3566
SMILES:
CNCc1cc(F)c(c(F)c1)-c1cc2c(n[nH]c2cn1)-c1cnn(C)c1
: