Target
Voltage-dependent calcium channel subunit alpha-2/delta-1
Ligand
BDBM485726
Substrate
Meas. Tech.
Binding Assay
Ki
>3000±n/a nM
Citation
 Almansa-Rosales, CYenes-Mínguez, SVirgili-Bernado, MAlonso-Xalma, M Quinoline and isoquinoline derivatives for treating pain and pain related conditions US Patent  US10941138 Publication Date 3/9/2021 
Target
Name:
Voltage-dependent calcium channel subunit alpha-2/delta-1
Synonyms:
CA2D1_HUMAN CACNL2A MHS3 Voltage-dependent calcium channel subunit delta-1 Voltage-gated calcium channel alpha2/delta subunit 1 | Voltage-gated calcium channel subunit alpha-2/delta-1
Type:
Enzyme
Mol. Mass.:
124544.88
Organism:
Homo sapiens (Human)
Description:
P54289
Residue:
1103
  
Inhibitor
Name:
BDBM485726
Synonyms:
3-(isoquinolin-8-yloxy)-N- methyl-3-(6- (trifluoromethyl)pyridin-2- yl)propan-1-amine | US10941138, Example 24
Type:
Small organic molecule
Emp. Form.:
C19H18F3N3O
Mol. Mass.:
361.3609
SMILES:
CNCCC(Oc1cccc2ccncc12)c1cccc(n1)C(F)(F)F
: