Target
Neuroepithelial cell-transforming gene 1 protein
Ligand
BDBM485713
Substrate
Meas. Tech.
Binding Assay
Ki
<100±n/a nM
Citation
 Almansa-Rosales, CYenes-Mínguez, SVirgili-Bernado, MAlonso-Xalma, M Quinoline and isoquinoline derivatives for treating pain and pain related conditions US Patent  US10941138 Publication Date 3/9/2021 
Target
Name:
Neuroepithelial cell-transforming gene 1 protein
Synonyms:
ARHG8_HUMAN NET1 Rho guanine nucleotide exchange factor 8
Type:
PROTEIN
Mol. Mass.:
67762.41
Organism:
Homo sapiens
Description:
ChEMBL_118125
Residue:
596
  
Inhibitor
Name:
BDBM485713
Synonyms:
(S)-3-(isoquinolin-5- yloxy)-N-methyl-3- (thiophen-2-yl)propan-1- amine | US10941138, Example 11
Type:
Small organic molecule
Emp. Form.:
C17H18N2OS
Mol. Mass.:
298.403
SMILES:
CNCC[C@H](Oc1cccc2cnccc12)c1cccs1
: