Target
Voltage-dependent calcium channel subunit alpha-2/delta-1
Ligand
BDBM485749
Substrate
Meas. Tech.
Binding Assay
Ki
300±n/a nM
Citation
 Almansa-Rosales, CYenes-Mínguez, SVirgili-Bernado, MAlonso-Xalma, M Quinoline and isoquinoline derivatives for treating pain and pain related conditions US Patent  US10941138 Publication Date 3/9/2021 
Target
Name:
Voltage-dependent calcium channel subunit alpha-2/delta-1
Synonyms:
CA2D1_HUMAN CACNL2A MHS3 Voltage-dependent calcium channel subunit delta-1 Voltage-gated calcium channel alpha2/delta subunit 1 | Voltage-gated calcium channel subunit alpha-2/delta-1
Type:
Enzyme
Mol. Mass.:
124544.88
Organism:
Homo sapiens (Human)
Description:
P54289
Residue:
1103
  
Inhibitor
Name:
BDBM485749
Synonyms:
3-(3-fluorothiophen-2-yl)- 3-(isoquinolin-8-yloxy)-N- methylpropan-1-amine | US10941138, Example 47
Type:
Small organic molecule
Emp. Form.:
C17H17FN2OS
Mol. Mass.:
316.393
SMILES:
CNCCC(Oc1cccc2ccncc12)c1sccc1F
: