Target
Neuroepithelial cell-transforming gene 1 protein
Ligand
BDBM485750
Substrate
Meas. Tech.
Binding Assay
Ki
300±n/a nM
Citation
 Almansa-Rosales, CYenes-Mínguez, SVirgili-Bernado, MAlonso-Xalma, M Quinoline and isoquinoline derivatives for treating pain and pain related conditions US Patent  US10941138 Publication Date 3/9/2021 
Target
Name:
Neuroepithelial cell-transforming gene 1 protein
Synonyms:
ARHG8_HUMAN NET1 Rho guanine nucleotide exchange factor 8
Type:
PROTEIN
Mol. Mass.:
67762.41
Organism:
Homo sapiens
Description:
ChEMBL_118125
Residue:
596
  
Inhibitor
Name:
BDBM485750
Synonyms:
3-(3-fluorothiophen-2-yl)- N-methyl-3-(quinolin-5- yloxy)propan-1-amine | US10941138, Example 48
Type:
Small organic molecule
Emp. Form.:
C17H17FN2OS
Mol. Mass.:
316.393
SMILES:
CNCCC(Oc1cccc2ncccc12)c1sccc1F
: