Target
Voltage-dependent calcium channel subunit alpha-2/delta-1
Ligand
BDBM485773
Substrate
Meas. Tech.
Binding Assay
Ki
1750±n/a nM
Citation
 Almansa-Rosales, CYenes-Mínguez, SVirgili-Bernado, MAlonso-Xalma, M Quinoline and isoquinoline derivatives for treating pain and pain related conditions US Patent  US10941138 Publication Date 3/9/2021 
Target
Name:
Voltage-dependent calcium channel subunit alpha-2/delta-1
Synonyms:
CA2D1_HUMAN CACNL2A MHS3 Voltage-dependent calcium channel subunit delta-1 Voltage-gated calcium channel alpha2/delta subunit 1 | Voltage-gated calcium channel subunit alpha-2/delta-1
Type:
Enzyme
Mol. Mass.:
124544.88
Organism:
Homo sapiens (Human)
Description:
P54289
Residue:
1103
  
Inhibitor
Name:
BDBM485773
Synonyms:
3-(isoquinolin-5-yloxy)-N- methyl-3-(thiazol-2- yl)propan-1-amine | US10941138, Example 71
Type:
Small organic molecule
Emp. Form.:
C16H17N3OS
Mol. Mass.:
299.391
SMILES:
CNCCC(Oc1cccc2cnccc12)c1nccs1
: