Target
Voltage-dependent calcium channel subunit alpha-2/delta-1
Ligand
BDBM485780
Substrate
Meas. Tech.
Binding Assay
Ki
<100±n/a nM
Citation
 Almansa-Rosales, CYenes-Mínguez, SVirgili-Bernado, MAlonso-Xalma, M Quinoline and isoquinoline derivatives for treating pain and pain related conditions US Patent  US10941138 Publication Date 3/9/2021 
Target
Name:
Voltage-dependent calcium channel subunit alpha-2/delta-1
Synonyms:
CA2D1_HUMAN CACNL2A MHS3 Voltage-dependent calcium channel subunit delta-1 Voltage-gated calcium channel alpha2/delta subunit 1 | Voltage-gated calcium channel subunit alpha-2/delta-1
Type:
Enzyme
Mol. Mass.:
124544.88
Organism:
Homo sapiens (Human)
Description:
P54289
Residue:
1103
  
Inhibitor
Name:
BDBM485780
Synonyms:
(S)-3-(5-Chlorothiophen-2-yl)-N-methyl-3-(quinolin-5-yloxy)propan-1-amine and (R)-3-(5-chlorothiophen-2-yl)-N-methyl-3-(quinolin-5-yloxy)propan-1-amine US10941138, Example 79
Type:
Small organic molecule
Emp. Form.:
C17H17ClN2OS
Mol. Mass.:
332.848
SMILES:
CNCC[C@@H](Oc1cccc2ncccc12)c1ccc(Cl)s1
: