Target
Neuromedin-K receptor
Ligand
BDBM485815
Substrate
Meas. Tech.
Binding Competition Assay
Ki
20.0±n/a nM
Citation
 Hoveyda, HRDutheuil, GFraser, GLRoy, MEl Bousmaqui, MBatt, F Chiral N-acyl-5,6,7(8-substituted)-tetrahydro-[1,2,4]triazolo[4,3-a]pyrazines as selective NK-3 receptor antagonists, pharmaceutical composition, methods for use in NK-3 receptor mediated disorders and chiral synthesis thereof US Patent  US10941151 Publication Date 3/9/2021 
Target
Name:
Neuromedin-K receptor
Synonyms:
NK-3 receptor NK3R NKR Neurokinin B receptor Neuromedin-3 receptor (NK-3R) Neuromedin-K receptor Neuromedin-K receptor (NK3) TAC3R Tachykinin receptor 3 | Tachykinin receptor 3 (NK3)
Type:
Enzyme
Mol. Mass.:
52221.96
Organism:
Homo sapiens (Human)
Description:
P29371
Residue:
465
  
Inhibitor
Name:
BDBM485815
Synonyms:
(3-(2-isopropylthiazol-4-yl)- 5,6-dihydro- [1,2,4]triazolo[4,3-a]pyrazin- 7(8H)-yl)(4-(thiophen-2- yl)phenyl)methanone | US10941151, Compound 18
Type:
Small organic molecule
Emp. Form.:
C21H20N6OS2
Mol. Mass.:
436.553
SMILES:
CN(C)c1nc(cs1)-c1nnc2CN(CCn12)C(=O)c1ccc(cc1)-c1cccs1
: