Target
Neuromedin-K receptor
Ligand
BDBM50081293
Substrate
Meas. Tech.
Binding Competition Assay
Ki
10.00±n/a nM
Citation
 Hoveyda, HRDutheuil, GFraser, GLRoy, MEl Bousmaqui, MBatt, F Chiral N-acyl-5,6,7(8-substituted)-tetrahydro-[1,2,4]triazolo[4,3-a]pyrazines as selective NK-3 receptor antagonists, pharmaceutical composition, methods for use in NK-3 receptor mediated disorders and chiral synthesis thereof US Patent  US10941151 Publication Date 3/9/2021 
Target
Name:
Neuromedin-K receptor
Synonyms:
NK-3 receptor NK3R NKR Neurokinin B receptor Neuromedin-3 receptor (NK-3R) Neuromedin-K receptor Neuromedin-K receptor (NK3) TAC3R Tachykinin receptor 3 | Tachykinin receptor 3 (NK3)
Type:
Enzyme
Mol. Mass.:
52221.96
Organism:
Homo sapiens (Human)
Description:
P29371
Residue:
465
  
Inhibitor
Name:
BDBM50081293
Synonyms:
CHEMBL3422007 US10683295, Compound 30 US9475814, 30
Type:
Small organic molecule
Emp. Form.:
C23H21N5OS
Mol. Mass.:
415.511
SMILES:
C[C@H]1N(CCn2c1nnc2-c1cccc(C)n1)C(=O)c1ccc(cc1)-c1cccs1
: