Target
Serine/threonine-protein kinase TBK1
Ligand
BDBM485824
Substrate
IC50
3.00±n/a nM
Citation
 Crew, APWang, JDong, HQian, Y Tank-binding kinase-1 PROTACs and associated methods of use US Patent  US10946017 Publication Date 3/16/2021 
Target
Name:
Serine/threonine-protein kinase TBK1
Synonyms:
NAK Protein cereblon/Serine/threonine-protein kinase TBK1 TANK-binding kinase 1 (TBK-1) TBK1 | TBK1_HUMAN
Type:
protein
Mol. Mass.:
83645.20
Organism:
Homo sapiens (Human)
Description:
Q9UHD2
Residue:
729
  
Inhibitor
Name:
BDBM485824
Synonyms:
US10946017, Compound 23
Type:
Small organic molecule
Emp. Form.:
C52H72IN9O9S
Mol. Mass.:
1126.152
SMILES:
CN(CCNc1nc(Nc2ccc(OCCCOCCCCOCCCOCC(=O)N[C@H](C(=O)N3C[C@H](O)C[C@H]3C(=O)NCc3ccc(cc3)-c3scnc3C)C(C)(C)C)cc2)ncc1I)C(=O)C1CCC1
: