Target
Genome polyprotein
Ligand
BDBM486331
Substrate
Meas. Tech.
RNA-Dependent RNA HCV NS5B (polymerase) Assay and IC50 Determination
IC50
550±n/a nM
Citation
 Jacobson, ICFeese, MDLee, SS Inhibitors of Hepatitis C virus polymerase US Patent  US10947210 Publication Date 3/16/2021 
Target
Name:
Genome polyprotein
Synonyms:
HCV 3a POLG_HCVK3
Type:
Enzyme Catalytic Domain
Mol. Mass.:
328455.91
Organism:
Hepatitis C virus genotype 3a (isolate k3a) (HCV)
Description:
Q81495
Residue:
3021
  
Inhibitor
Name:
BDBM486331
Synonyms:
US10947210, Compound 29-7
Type:
Small organic molecule
Emp. Form.:
C33H34FN3O10S
Mol. Mass.:
683.701
SMILES:
CNC(=O)c1c(oc2cc(N(CCOCCOCc3ccc(C(=O)OC)c(c3)[N+]([O-])=O)S(C)(=O)=O)c(cc12)C1CC1)-c1ccc(F)cc1
: