Target
Diacylglycerol O-acyltransferase 2
Ligand
BDBM486352
Substrate
Meas. Tech.
DGAT2 Enzymatic Activity Assay
IC50
8.80±n/a nM
Citation
 Shen, DGraham, THJiang, JDing, FTudge, C Indole derivatives useful as inhibitors of diacylglyceride O-acyltransferase 2 US Patent  US10947222 Publication Date 3/16/2021 
Target
Name:
Diacylglycerol O-acyltransferase 2
Synonyms:
ARAT DGAT2 Diacylglycerol O-acyltransferase 2 (DGAT2) Retinol O-fatty-acyltransferase
Type:
Multi-pass membrane protein
Mol. Mass.:
43848.90
Organism:
Homo sapiens (Human)
Description:
Q96PD7
Residue:
388
  
Inhibitor
Name:
BDBM486352
Synonyms:
US10947222, Example 1
Type:
Small organic molecule
Emp. Form.:
C26H22ClFN2O3S
Mol. Mass.:
496.981
SMILES:
CC1(CCS(=O)(=O)C1)NC(=O)c1ccc2c(cn(-c3ccc(F)cc3)c2c1)-c1ccccc1Cl
: