Target
Diacylglycerol O-acyltransferase 2
Ligand
BDBM486397
Substrate
Meas. Tech.
DGAT2 Enzymatic Activity Assay
IC50
17.0±n/a nM
Citation
 Shen, DGraham, THJiang, JDing, FTudge, C Indole derivatives useful as inhibitors of diacylglyceride O-acyltransferase 2 US Patent  US10947222 Publication Date 3/16/2021 
Target
Name:
Diacylglycerol O-acyltransferase 2
Synonyms:
ARAT DGAT2 Diacylglycerol O-acyltransferase 2 (DGAT2) Retinol O-fatty-acyltransferase
Type:
Multi-pass membrane protein
Mol. Mass.:
43848.90
Organism:
Homo sapiens (Human)
Description:
Q96PD7
Residue:
388
  
Inhibitor
Name:
BDBM486397
Synonyms:
US10947222, Example 28
Type:
Small organic molecule
Emp. Form.:
C28H25F3N2O4S
Mol. Mass.:
542.569
SMILES:
Cc1c(-c2cccc(OC(F)F)c2)c2ccc(cc2n1-c1ccc(F)cc1)C(=O)NC1(C)CCS(=O)(=O)C1
: