Target
Non-receptor tyrosine-protein kinase TYK2
Ligand
BDBM431909
Substrate
Meas. Tech.
Biochemical JAK Kinase Assays
Ki
0.398±n/a nM
Citation
 Long, DDSmith, CThompson, C Dimethyl amino azetidine amides as JAK inhibitors US Patent  US10947229 Publication Date 3/16/2021 
Target
Name:
Non-receptor tyrosine-protein kinase TYK2
Synonyms:
Non-receptor tyrosine-protein kinase TYK2 (TYK2) TYK2_HUMAN | Tyrosine-protein kinase TYK2
Type:
Protein
Mol. Mass.:
133666.03
Organism:
Homo sapiens (Human)
Description:
P29597
Residue:
1187
  
Inhibitor
Name:
BDBM431909
Synonyms:
US10550118, Example 8-16 US11453668, Example 8-16 | US11634419, Example C-4
Type:
Small organic molecule
Emp. Form.:
C31H38FN7O2
Mol. Mass.:
559.6775
SMILES:
CCc1cc(O)c(F)cc1-c1ccc2c(n[nH]c2c1)-c1nc2C[C@H](N(Cc2[nH]1)C(C)C)C(=O)N1CC(C)(C1)N(C)C
: