Target
Tyrosine-protein kinase JAK3
Ligand
BDBM473569
Substrate
Meas. Tech.
Biochemical JAK Kinase Assays
Ki
0.050±n/a nM
Citation
 Long, DDSmith, CThompson, C Dimethyl amino azetidine amides as JAK inhibitors US Patent  US10947229 Publication Date 3/16/2021 
Target
Name:
Tyrosine-protein kinase JAK3
Synonyms:
JAK-3 JAK3_HUMAN Janus kinase 3 (JAK3) L-JAK | Leukocyte janus kinase
Type:
Protein
Mol. Mass.:
125111.08
Organism:
Homo sapiens (Human)
Description:
P52333
Residue:
1124
  
Inhibitor
Name:
BDBM473569
Synonyms:
US10844057, Example 12 US11634419, Example 5
Type:
Small organic molecule
Emp. Form.:
C30H37N7O2
Mol. Mass.:
527.6605
SMILES:
CCCN1Cc2[nH]c(nc2C[C@H]1C(=O)N1CC(C1)N(C)C)-c1n[nH]c2cc(ccc12)-c1ccc(O)cc1CC
: