Target
Fibroblast growth factor receptor 2
Ligand
BDBM278505
Substrate
Meas. Tech.
FGFR Enzymatic Assay
IC50
<100±n/a nM
Citation
 Sun, YYao, WWu, LXu, MQian, DZhang, F Bicyclic heterocycles as FGFR inhibitors US Patent  US10947230 Publication Date 3/16/2021 
Target
Name:
Fibroblast growth factor receptor 2
Synonyms:
BEK FGFR-2 FGFR2 Fibroblast growth factor receptor 2 (FGFR2) KGFR Keratinocyte growth factor receptor VEGF-receptor 2 and Fibroblast growth factor receptor 2
Type:
Enzyme
Mol. Mass.:
92015.45
Organism:
Homo sapiens (Human)
Description:
P21802
Residue:
821
  
Inhibitor
Name:
BDBM278505
Synonyms:
7-amino-3-(2,6-difluoro-3,5-dimethoxyphenyl)-8-(3,6-dihydro-2H-pyran-4-yl)-1-methyl-3,4-dihydropyrido[4,3-d]pyrimidin-2(1H)-one US10450313, Example 21 US11530214, Example 21
Type:
Small organic molecule
Emp. Form.:
C21H22F2N4O4
Mol. Mass.:
432.4206
SMILES:
COc1cc(OC)c(F)c(N2Cc3cnc(N)c(C4=CCOCC4)c3N(C)C2=O)c1F
: