Target
Fibroblast growth factor receptor 1
Ligand
BDBM278506
Substrate
Meas. Tech.
FGFR Enzymatic Assay
IC50
<100±n/a nM
Citation
 Sun, YYao, WWu, LXu, MQian, DZhang, F Bicyclic heterocycles as FGFR inhibitors US Patent  US10947230 Publication Date 3/16/2021 
Target
Name:
Fibroblast growth factor receptor 1
Synonyms:
BFGFR Basic fibroblast growth factor receptor 1 (FGFR1) CEK FGFR-1 FGFR-1, (FL) FGFR1_HUMAN FLT2 Fibroblast growth factor receptor 1 (FGFR-1) Fms-like tyrosine kinase 2 N-sam bFGF-R | c-fgr
Type:
Receptor
Mol. Mass.:
91861.70
Organism:
Homo sapiens (Human)
Description:
P11362
Residue:
822
  
Inhibitor
Name:
BDBM278506
Synonyms:
6-amino-2-(2,6-difluoro-3,5-dimethoxyphenyl)-4,4-dimethyl-1,2-dihydro-2,7-naphthyridin-3(4H)-one US10450313, Example 22 US11530214, Example 22
Type:
Small organic molecule
Emp. Form.:
C18H19F2N3O3
Mol. Mass.:
363.3586
SMILES:
COc1cc(OC)c(F)c(N2Cc3cnc(N)cc3C(C)(C)C2=O)c1F
: