Target
Fibroblast growth factor receptor 3
Ligand
BDBM278509
Substrate
Meas. Tech.
FGFR Enzymatic Assay
IC50
<100±n/a nM
Citation
 Sun, YYao, WWu, LXu, MQian, DZhang, F Bicyclic heterocycles as FGFR inhibitors US Patent  US10947230 Publication Date 3/16/2021 
Target
Name:
Fibroblast growth factor receptor 3
Synonyms:
CD_antigen: CD333 FGFR3 Fibroblast growth factor receptor JTK4
Type:
Protein
Mol. Mass.:
87699.57
Organism:
Homo sapiens (Human)
Description:
P22607
Residue:
806
  
Inhibitor
Name:
BDBM278509
Synonyms:
2'-(2,6-difluoro-3,5-dimethoxyphenyl)-6'-(methylamino)-1',2'-dihydro-3'H-spiro[cyclopropane-1,4'-[2,7]naphthyridin]-3'-one US10450313, Example 25 US11530214, Example 25
Type:
Small organic molecule
Emp. Form.:
C19H19F2N3O3
Mol. Mass.:
375.3693
SMILES:
CNc1cc2c(CN(C(=O)C22CC2)c2c(F)c(OC)cc(OC)c2F)cn1
: