Target
Fibroblast growth factor receptor 2
Ligand
BDBM278516
Substrate
Meas. Tech.
FGFR Enzymatic Assay
IC50
<100±n/a nM
Citation
 Sun, YYao, WWu, LXu, MQian, DZhang, F Bicyclic heterocycles as FGFR inhibitors US Patent  US10947230 Publication Date 3/16/2021 
Target
Name:
Fibroblast growth factor receptor 2
Synonyms:
BEK FGFR-2 FGFR2 Fibroblast growth factor receptor 2 (FGFR2) KGFR Keratinocyte growth factor receptor VEGF-receptor 2 and Fibroblast growth factor receptor 2
Type:
Enzyme
Mol. Mass.:
92015.45
Organism:
Homo sapiens (Human)
Description:
P21802
Residue:
821
  
Inhibitor
Name:
BDBM278516
Synonyms:
2'-(2,6-difluoro-3,5-dimethoxyphenyl)-6'-(pyridin-3-ylamino)-1'H-spiro[cyclopropane-1,4'-[2,7]naphthyridin]-3'(2'H)-one US10450313, Example 32 US11530214, Example 32
Type:
Small organic molecule
Emp. Form.:
C23H20F2N4O3
Mol. Mass.:
438.4267
SMILES:
COc1cc(OC)c(F)c(N2Cc3cnc(Nc4cccnc4)cc3C3(CC3)C2=O)c1F
: