Target
Fibroblast growth factor receptor 3
Ligand
BDBM278521
Substrate
Meas. Tech.
FGFR Enzymatic Assay
IC50
<100±n/a nM
Citation
 Sun, YYao, WWu, LXu, MQian, DZhang, F Bicyclic heterocycles as FGFR inhibitors US Patent  US10947230 Publication Date 3/16/2021 
Target
Name:
Fibroblast growth factor receptor 3
Synonyms:
CD_antigen: CD333 FGFR3 Fibroblast growth factor receptor JTK4
Type:
Protein
Mol. Mass.:
87699.57
Organism:
Homo sapiens (Human)
Description:
P22607
Residue:
806
  
Inhibitor
Name:
BDBM278521
Synonyms:
2'-(2,6-difluoro-3,5-dimethoxyphenyl)-6'-((1-methyl-1H-pyrazol-4-yl)methylamino)-1'H-spiro[cyclopropane-1,4'-[2,7]naphthyridin]-3'(2'H)-one US10947230, Example 37 | US11530214, Example 37
Type:
Small organic molecule
Emp. Form.:
C23H23F2N5O3
Mol. Mass.:
455.4572
SMILES:
COc1cc(OC)c(F)c(N2Cc3cnc(NCc4cnn(C)c4)cc3C3(CC3)C2=O)c1F
: