Target
Fibroblast growth factor receptor 3
Ligand
BDBM278530
Substrate
Meas. Tech.
FGFR Enzymatic Assay
IC50
<100±n/a nM
Citation
 Sun, YYao, WWu, LXu, MQian, DZhang, F Bicyclic heterocycles as FGFR inhibitors US Patent  US10947230 Publication Date 3/16/2021 
Target
Name:
Fibroblast growth factor receptor 3
Synonyms:
CD_antigen: CD333 FGFR3 Fibroblast growth factor receptor JTK4
Type:
Protein
Mol. Mass.:
87699.57
Organism:
Homo sapiens (Human)
Description:
P22607
Residue:
806
  
Inhibitor
Name:
BDBM278530
Synonyms:
7-amino-3-(2,6-difluoro-3,5-dimethoxyphenyl)-8-methyl-1-(2-methyl-2H-tetrazol-5-yl)-3,4-dihydropyrido[4,3-d]pyrimidin-2(1H)-one US10450313, Example 46 US11530214, Example 46
Type:
Small organic molecule
Emp. Form.:
C18H18F2N8O3
Mol. Mass.:
432.3841
SMILES:
COc1cc(OC)c(F)c(N2Cc3cnc(N)c(C)c3N(c3nnn(C)n3)C2=O)c1F
: