Target
Protein arginine N-methyltransferase 5
Ligand
BDBM486487
Substrate
Meas. Tech.
PRMT5-MEP50 Enzyme Methylation Assay 1
IC50
272±n/a nM
Citation
 Machacek, MRWitter, DJReutershan, MHAltman, MDStupple, PA PRMT5 inhibitors US Patent  US10947234 Publication Date 3/16/2021 
Target
Name:
Protein arginine N-methyltransferase 5
Synonyms:
72 kDa ICln-binding protein HRMT1L5 IBP72 Jak-binding protein 1 PRMT5/MEP50 complex Protein arginine methyltransferase 5 (PRMT5) SKB1 homolog Shk1 kinase-binding protein 1 homolog
Type:
Enzyme
Mol. Mass.:
72679.99
Organism:
Homo sapiens (Human)
Description:
O14744
Residue:
637
  
Inhibitor
Name:
BDBM486487
Synonyms:
7-((1-acetylpiperidin-4-yl)amino)-4-ethyl-2-(2-hydroxy-2-((S)-1,2,3,4-tetrahydroisoquinolin-3-yl)ethyl)-3,4-dihydro-2,6-naphthyridin-1(2H)-one Isomer 3-2 | US10947234, Example 10
Type:
Small organic molecule
Emp. Form.:
C28H37N5O3
Mol. Mass.:
491.6251
SMILES:
CC[C@@H]1CN(C[C@H](O)[C@@H]2Cc3ccccc3CN2)C(=O)c2cc(NC3CCN(CC3)C(C)=O)ncc12
: