Target
Resistin
Ligand
BDBM486504
Substrate
Meas. Tech.
Evaluation of the Ability to Inhibit TNF-α Secretion by human Resistin
IC50
700±n/a nM
Citation
 Yoo, JKLee, NLee, CHJung, MKim, H Phenyl phthalazine derivative, method for the preparation thereof, and pharmaceutical composition comprising the same US Patent  US10947241 Publication Date 3/16/2021 
Target
Name:
Resistin
Synonyms:
ADSF C/EBP-epsilon-regulated myeloid-specific secreted cysteine-rich protein Cysteine-rich secreted protein FIZZ3 HXCP1 RETN_HUMAN | RSTN
Type:
Protein
Mol. Mass.:
11419.78
Organism:
Human
Description:
Q9HD89
Residue:
108
  
Inhibitor
Name:
BDBM486504
Synonyms:
US10947241, Example 47
Type:
Small organic molecule
Emp. Form.:
C23H26ClN5O
Mol. Mass.:
423.938
SMILES:
CC(C)[C@H](N)C(=O)N1CCN(CC1)c1nnc(-c2ccc(Cl)cc2)c2ccccc12
: