Target
Tyrosine-protein kinase SYK [342-635]
Ligand
BDBM375961
Substrate
Meas. Tech.
Syk Kinase Test
IC50
17.2±n/a nM
Citation
 Dahmann, GHoffmann, MKlicic Badoux, JLamb, DJMcCarthy, CNapier, SCParrish, KScott, JFitzgerald, JLWalker, E Heteroaryl SYK inhibitors US Patent  US10947243 Publication Date 3/16/2021 
Target
Name:
Tyrosine-protein kinase SYK [342-635]
Synonyms:
KSYK_HUMAN SYK (aa 342-635)
Type:
Enzyme Catalytic Domain
Mol. Mass.:
34105.36
Organism:
Homo sapiens (Human)
Description:
P43405[342-635]
Residue:
294
  
Inhibitor
Name:
BDBM375961
Synonyms:
US10947243, Example 36 | US9914735, Example 36
Type:
Small organic molecule
Emp. Form.:
C22H24N6O2
Mol. Mass.:
404.465
SMILES:
C[C@@H](Oc1cc(cc2nn(C)cc12)-c1ccc2n(C)nc(N)c2c1)[C@H]1CNC(=O)C1
: