Target
Tyrosine-protein kinase SYK [342-635]
Ligand
BDBM376002
Substrate
Meas. Tech.
GSK 3beta Kinase-Test
IC50
3.00±n/a nM
Citation
 Dahmann, GHoffmann, MKlicic Badoux, JLamb, DJMcCarthy, CNapier, SCParrish, KScott, JFitzgerald, JLWalker, E Heteroaryl SYK inhibitors US Patent  US10947243 Publication Date 3/16/2021 
Target
Name:
Tyrosine-protein kinase SYK [342-635]
Synonyms:
KSYK_HUMAN SYK (aa 342-635)
Type:
Enzyme Catalytic Domain
Mol. Mass.:
34105.36
Organism:
Homo sapiens (Human)
Description:
P43405[342-635]
Residue:
294
  
Inhibitor
Name:
BDBM376002
Synonyms:
US10947243, Example 81 | US9914735, Example 81
Type:
Small organic molecule
Emp. Form.:
C23H28N4O4
Mol. Mass.:
424.4928
SMILES:
COc1cc(ccc1OC(C)C)-c1cc2nn(C)cc2c(O[C@H](C)[C@H]2CNC(=O)C2)n1
: