Target
Sodium channel protein type 9 subunit alpha
Ligand
BDBM486521
Substrate
Meas. Tech.
Electrophysiological Assay (EP) (In Vitro Assay)
IC50
2.26±n/a nM
Citation
 McKerrall, SSafina, BSKolesnikov, AZhang, BLiu, WLai, KW Therapeutic compounds and methods of use thereof US Patent  US10947251 Publication Date 3/16/2021 
Target
Name:
Sodium channel protein type 9 subunit alpha
Synonyms:
NENA Peripheral sodium channel 1 SCN9A_HUMAN Voltage-gated sodium channel subunit Nav1.7 hNE-Na
Type:
Protein
Mol. Mass.:
226375.97
Organism:
Homo sapiens (Human)
Description:
Q15858
Residue:
1988
  
Inhibitor
Name:
BDBM486521
Synonyms:
4 | US10947251, Example 3
Type:
Small organic molecule
Emp. Form.:
C24H22F4N4O6S
Mol. Mass.:
570.513
SMILES:
COc1cc(c(F)cc1N1[C@@H]2CCN(C[C@H]2OCC1=O)S(=O)(=O)Nc1ccon1)-c1cccc(c1)C(F)(F)F
: