Target
Sodium channel protein type 9 subunit alpha
Ligand
BDBM486547
Substrate
Meas. Tech.
Electrophysiological Assay (EP) (In Vitro Assay)
IC50
237±n/a nM
Citation
 McKerrall, SSafina, BSKolesnikov, AZhang, BLiu, WLai, KW Therapeutic compounds and methods of use thereof US Patent  US10947251 Publication Date 3/16/2021 
Target
Name:
Sodium channel protein type 9 subunit alpha
Synonyms:
NENA Peripheral sodium channel 1 SCN9A_HUMAN Voltage-gated sodium channel subunit Nav1.7 hNE-Na
Type:
Protein
Mol. Mass.:
226375.97
Organism:
Homo sapiens (Human)
Description:
Q15858
Residue:
1988
  
Inhibitor
Name:
BDBM486547
Synonyms:
US10947251, Example 24
Type:
Small organic molecule
Emp. Form.:
C24H19F4N5O5S
Mol. Mass.:
565.497
SMILES:
Fc1cc(N2[C@H]3CCN(C[C@@H]3OCC2=O)S(=O)(=O)Nc2ccon2)c(cc1-c1cccc(c1)C(F)(F)F)C#N
: