Target
Sodium channel protein type 9 subunit alpha
Ligand
BDBM486549
Substrate
Meas. Tech.
Electrophysiological Assay (EP) (In Vitro Assay)
IC50
10.6±n/a nM
Citation
 McKerrall, SSafina, BSKolesnikov, AZhang, BLiu, WLai, KW Therapeutic compounds and methods of use thereof US Patent  US10947251 Publication Date 3/16/2021 
Target
Name:
Sodium channel protein type 9 subunit alpha
Synonyms:
NENA Peripheral sodium channel 1 SCN9A_HUMAN Voltage-gated sodium channel subunit Nav1.7 hNE-Na
Type:
Protein
Mol. Mass.:
226375.97
Organism:
Homo sapiens (Human)
Description:
Q15858
Residue:
1988
  
Inhibitor
Name:
BDBM486549
Synonyms:
US10947251, Example 26
Type:
Small organic molecule
Emp. Form.:
C24H24F4N4O5S
Mol. Mass.:
556.53
SMILES:
COc1cc(c(F)cc1N1CCO[C@H]2CN(CC[C@H]12)S(=O)(=O)Nc1ccon1)-c1cccc(c1)C(F)(F)F
: