Target
Sodium channel protein type 9 subunit alpha
Ligand
BDBM486560
Substrate
Meas. Tech.
Tritiated Compound Binding to Membranes Isolated from Cells that Heterologous Express hNav1.7 and the beta1 Subunit
IC50
112±n/a nM
Citation
 McKerrall, SSafina, BSKolesnikov, AZhang, BLiu, WLai, KW Therapeutic compounds and methods of use thereof US Patent  US10947251 Publication Date 3/16/2021 
Target
Name:
Sodium channel protein type 9 subunit alpha
Synonyms:
NENA Peripheral sodium channel 1 SCN9A_HUMAN Voltage-gated sodium channel subunit Nav1.7 hNE-Na
Type:
Protein
Mol. Mass.:
226375.97
Organism:
Homo sapiens (Human)
Description:
Q15858
Residue:
1988
  
Inhibitor
Name:
BDBM486560
Synonyms:
34 | US10947251, Example 33
Type:
Small organic molecule
Emp. Form.:
C24H22F4N4O6S
Mol. Mass.:
570.513
SMILES:
[H][C@]12COC(=O)N(c3cc(F)c(cc3OC)-c3cccc(c3)C(F)(F)F)[C@]1([H])CCN(C2)S(=O)(=O)Nc1ccon1
: