Target
Sodium channel protein type 9 subunit alpha
Ligand
BDBM486561
Substrate
Meas. Tech.
Electrophysiological Assay (EP) (In Vitro Assay)
IC50
196±n/a nM
Citation
 McKerrall, SSafina, BSKolesnikov, AZhang, BLiu, WLai, KW Therapeutic compounds and methods of use thereof US Patent  US10947251 Publication Date 3/16/2021 
Target
Name:
Sodium channel protein type 9 subunit alpha
Synonyms:
NENA Peripheral sodium channel 1 SCN9A_HUMAN Voltage-gated sodium channel subunit Nav1.7 hNE-Na
Type:
Protein
Mol. Mass.:
226375.97
Organism:
Homo sapiens (Human)
Description:
Q15858
Residue:
1988
  
Inhibitor
Name:
BDBM486561
Synonyms:
US10947251, Example 34
Type:
Small organic molecule
Emp. Form.:
C24H22F4N4O6S
Mol. Mass.:
570.513
SMILES:
[H][C@@]12COC(=O)N(c3cc(F)c(cc3OC)-c3cccc(c3)C(F)(F)F)[C@@]1([H])CCN(C2)S(=O)(=O)Nc1ccon1
: