Target
Induced myeloid leukemia cell differentiation protein Mcl-1
Ligand
BDBM487501
Substrate
Meas. Tech.
Fluorescence Polarization Anisotropy Competition Assay
Ki
360±n/a nM
Citation
 Lee, TKim, KChristov, PPBelmar, JBurke, JPOlejniczak, ETFesik, SW Substituted indole Mcl-1 inhibitors US Patent  US10954193 Publication Date 3/23/2021 
Target
Name:
Induced myeloid leukemia cell differentiation protein Mcl-1
Synonyms:
BCL2L3 Bcl-2-like protein 3 (Mcl-1) Bcl2-L-3 MCL1 Mcl-1 Myeloid cell leukemia sequence 1 (BCL2-related) | mcl1/EAT
Type:
Membrane; Single-pass membrane protein
Mol. Mass.:
37332.87
Organism:
Homo sapiens (Human)
Description:
Q07820
Residue:
350
  
Inhibitor
Name:
BDBM487501
Synonyms:
US10954193, Example 20
Type:
Small organic molecule
Emp. Form.:
C23H26Cl2N2O4S
Mol. Mass.:
497.435
SMILES:
Cc1cc(OCCCc2cn(CCC(=O)NS(C)(=O)=O)c3cc(Cl)ccc23)cc(C)c1Cl
: