Target
Mucosa-associated lymphoid tissue lymphoma translocation protein 1
Ligand
BDBM487732
Substrate
Meas. Tech.
In Vitro Assay
IC50
19.0±n/a nM
Citation
 Lu, TAllison, BDBarbay, JKConnolly, PJCummings, MDDiels, GEdwards, JPKreutter, KDPhilippar, UShen, FThuring, JWWu, TBerthelot, DJ Pyrazole derivatives as MALT1 inhibitors US Patent  US10954214 Publication Date 3/23/2021 
Target
Name:
Mucosa-associated lymphoid tissue lymphoma translocation protein 1
Synonyms:
MALT lymphoma-associated translocation MALT1 MLT Paracaspase
Type:
Enzyme
Mol. Mass.:
92257.81
Organism:
Homo sapiens (Human)
Description:
Q9UDY8
Residue:
824
  
Inhibitor
Name:
BDBM487732
Synonyms:
N-(6-(4-amino-2H-1,2,3-triazol- 2-yl)-5-chloropyridin-3-yl)-1- (quinolin-5-yl)-5- (trifluoromethyl)-1H-pyrazole-4- carboxamide | US10954214, Compound 154
Type:
Small organic molecule
Emp. Form.:
C21H13ClF3N9O
Mol. Mass.:
499.836
SMILES:
Nc1cnn(n1)-c1ncc(NC(=O)c2cnn(c2C(F)(F)F)-c2cccc3ncccc23)cc1Cl
: