Target
Mucosa-associated lymphoid tissue lymphoma translocation protein 1
Ligand
BDBM488005
Substrate
Meas. Tech.
In Vitro Assay
IC50
9.00±n/a nM
Citation
 Lu, TAllison, BDBarbay, JKConnolly, PJCummings, MDDiels, GEdwards, JPKreutter, KDPhilippar, UShen, FThuring, JWWu, TBerthelot, DJ Pyrazole derivatives as MALT1 inhibitors US Patent  US10954214 Publication Date 3/23/2021 
Target
Name:
Mucosa-associated lymphoid tissue lymphoma translocation protein 1
Synonyms:
MALT lymphoma-associated translocation MALT1 MLT Paracaspase
Type:
Enzyme
Mol. Mass.:
92257.81
Organism:
Homo sapiens (Human)
Description:
Q9UDY8
Residue:
824
  
Inhibitor
Name:
BDBM488005
Synonyms:
(R)-N-(5-chloro-6-(2H-1,2,3- triazol-2-yl)pyridin-3-yl)-1-(1- (3-hydroxypyrrolidin-1- yl)isoquinolin-4-yl)-5- (trifluoromethyl)-1H-pyrazole-4- carboxamide | US10954214, Compound 427
Type:
Small organic molecule
Emp. Form.:
C25H19ClF3N9O2
Mol. Mass.:
569.926
SMILES:
O[C@@H]1CCN(C1)c1ncc(-n2ncc(C(=O)Nc3cnc(c(Cl)c3)-n3nccn3)c2C(F)(F)F)c2ccccc12
: