Target
Mucosa-associated lymphoid tissue lymphoma translocation protein 1
Ligand
BDBM488008
Substrate
Meas. Tech.
In Vitro Assay
IC50
13.0±n/a nM
Citation
 Lu, TAllison, BDBarbay, JKConnolly, PJCummings, MDDiels, GEdwards, JPKreutter, KDPhilippar, UShen, FThuring, JWWu, TBerthelot, DJ Pyrazole derivatives as MALT1 inhibitors US Patent  US10954214 Publication Date 3/23/2021 
Target
Name:
Mucosa-associated lymphoid tissue lymphoma translocation protein 1
Synonyms:
MALT lymphoma-associated translocation MALT1 MLT Paracaspase
Type:
Enzyme
Mol. Mass.:
92257.81
Organism:
Homo sapiens (Human)
Description:
Q9UDY8
Residue:
824
  
Inhibitor
Name:
BDBM488008
Synonyms:
N-(5-chloro-6-(2H-1,2,3-triazol- 2-yl)pyridin-3-yl)-1-(7-(3- hydroxyazetidin-1-yl)thieno[2,3- c]pyridin-4-yl)-5- (trifluoromethyl)-1H-pyrazole-4- carboxamide | US10954214, Compound 430
Type:
Small organic molecule
Emp. Form.:
C22H15ClF3N9O2S
Mol. Mass.:
561.927
SMILES:
OC1CN(C1)c1ncc(-n2ncc(C(=O)Nc3cnc(c(Cl)c3)-n3nccn3)c2C(F)(F)F)c2ccsc12
: