Target
Mucosa-associated lymphoid tissue lymphoma translocation protein 1
Ligand
BDBM488028
Substrate
Meas. Tech.
In Vitro Assay
IC50
10.00±n/a nM
Citation
 Lu, TAllison, BDBarbay, JKConnolly, PJCummings, MDDiels, GEdwards, JPKreutter, KDPhilippar, UShen, FThuring, JWWu, TBerthelot, DJ Pyrazole derivatives as MALT1 inhibitors US Patent  US10954214 Publication Date 3/23/2021 
Target
Name:
Mucosa-associated lymphoid tissue lymphoma translocation protein 1
Synonyms:
MALT lymphoma-associated translocation MALT1 MLT Paracaspase
Type:
Enzyme
Mol. Mass.:
92257.81
Organism:
Homo sapiens (Human)
Description:
Q9UDY8
Residue:
824
  
Inhibitor
Name:
BDBM488028
Synonyms:
N-(5-chloro-6-(2H-1,2,3-triazol- 2-yl)pyridin-3-yl)-1-(quinolin-4- yl)-5-(trifluoromethyl)-1H- pyrazole-4-carboxamide | US10954214, Compound 450
Type:
Small organic molecule
Emp. Form.:
C21H12ClF3N8O
Mol. Mass.:
484.821
SMILES:
FC(F)(F)c1c(cnn1-c1ccnc2ccccc12)C(=O)Nc1cnc(c(Cl)c1)-n1nccn1
: