Target
Sigma intracellular receptor 2
Ligand
BDBM488121
Substrate
Meas. Tech.
TBD
Ki
89.0±n/a nM
Citation
 Martin, SFSahn, JJLinkens, KT Sigma receptor binders US Patent  US10954217 Publication Date 3/23/2021 
Target
Name:
Sigma intracellular receptor 2
Synonyms:
MAC30 S2R Sigma-2 receptor TMEM97 | Transmembrane protein 97
Type:
Protein
Mol. Mass.:
20857.20
Organism:
Homo sapiens (Human)
Description:
Q5BJF2
Residue:
176
  
Inhibitor
Name:
BDBM488121
Synonyms:
US10954217, Example KTL-01-121
Type:
Small organic molecule
Emp. Form.:
C19H20Cl2N2O
Mol. Mass.:
363.281
SMILES:
Clc1cc(Cl)cc(CN2Cc3ccc(cc3C2)N2CCOCC2)c1
: