Target
Sigma non-opioid intracellular receptor 1
Ligand
BDBM50370517
Substrate
Meas. Tech.
TBD
Ki
250±n/a nM
Citation
 Martin, SFSahn, JJLinkens, KT Sigma receptor binders US Patent  US10954217 Publication Date 3/23/2021 
Target
Name:
Sigma non-opioid intracellular receptor 1
Synonyms:
Aging-associated gene 8 protein SGMR1_HUMAN SIGMAR1 SR31747-binding protein Sigma 1-type opioid receptor Sigma1R | hSigmaR1
Type:
Enzyme Catalytic Domain
Mol. Mass.:
25124.85
Organism:
Homo sapiens (Human)
Description:
Q99720
Residue:
223
  
Inhibitor
Name:
BDBM50370517
Synonyms:
CHEMBL4163428 | US10954217, Example 00227
Type:
Small organic molecule
Emp. Form.:
C21H25N3O2
Mol. Mass.:
351.4421
SMILES:
CN1CCN(CC1)c1ccc2CN(Cc2c1)C(=O)OCc1ccccc1
: